{"text_format":"1","workbook":"xlsx","n_sheets":9,"sheets":["Menu","Notes","Instructions & Methodology","Assumptions","Index","Results","Detailed Calcs","Graphs","Goal seek"],"not_rendered":{"charts":5,"images":10,"macros":1,"external_links":0,"defined_names":88,"comments":0,"pivot_tables":0},"unopened":[],"bounds":{"document_bytes":16777216,"sheet_cells":100000,"rows_first":2000,"rows_last":500,"rows_between":2000,"halvings":0,"cell_chars":16384,"cell_head_chars":4096},"cells_cut":0,"cells_raw":0,"read":"whole","date_system":"1900"}

{"sheet":"Menu","index":0,"n_rows":0,"n_cols":0,"rows_kept":0,"cut":false,"hidden":false,"merged":[]}

{"sheet":"Notes","index":1,"n_rows":120,"n_cols":5,"rows_kept":120,"cut":false,"hidden":false,"merged":[]}
[]
[]
[]
[]
["Prepared for:","{Client Name}",null,null,{"$f":"NOW()","v":"2025-10-02T09:57:56.310"}]
["Prepared by:","{Adviser Name}"]
{"$rows_left_out":115}
{"sheet":"Instructions & Methodology","index":2,"n_rows":109,"n_cols":1,"rows_kept":109,"cut":false,"hidden":false,"merged":[]}
[]
[]
[]
[]
[]
[]
{"$rows_left_out":104}
{"sheet":"Assumptions","index":3,"n_rows":128,"n_cols":19,"rows_kept":128,"cut":false,"hidden":false,"merged":[]}
[]
[]
[]
[null,null,null,null,null,null,null,null,null,null,"(hide)","(hide)","(hide)","(hide)","(hide)","(hide)","(hide)","(hide)","(hide)"]
["Prepared for:","{Client Name}",null,null,null,null,null,{"$f":"NOW()","v":"2025-10-02T09:57:56.310"}]
["Prepared by:","{Adviser Name}",null,null,null,null,null,null,null,null,{"$f":"K19=\"\"","v":true},{"$f":"K7=\"\"","v":true},{"$f":"K18=\"\"","v":true}]
{"$rows_left_out":123}
{"sheet":"Index","index":4,"n_rows":538,"n_cols":14,"rows_kept":538,"cut":false,"hidden":true,"merged":[]}
[null,null,null,null,null,null,null,null,null,null,null,null,0.03,"margin above cash rate"]
["Month","Price index (XKO)","Accumulation Index (XKO)","Month growth","Month total return","Month Income","Reference","Year growth","Year total return","Year Income","Cash Benchmark","Cash annual return","Approx Gearing Rate"]
["1980-12-01",713.5,1488.6,null,null,null,1,null,null,null,547.53499999999997]
["1981-01-01",657,1373.8,{"$f":"B4/B3-1","v":-7.9187105816397985E-2},{"$f":"C4/C3-1","v":-7.7119441085583773E-2},{"$f":"E4-D4","v":2.0676647308142115E-3},{"$f":"G3+1","v":2},null,null,null,553.09100000000001]
["1981-02-01",652.20000000000005,1366.6,{"$f":"B5/B4-1","v":-7.3059360730592937E-3},{"$f":"C5/C4-1","v":-5.2409375454942619E-3},{"$f":"E5-D5","v":2.0649985275650318E-3},{"$f":"G4+1","v":3},null,null,null,558.95500000000004]
["1981-03-01",707.9,1495.2,8.5403250536645103E-2,9.4102151324454875E-2,8.6989007878097713E-3,4,null,null,null,564.82000000000005]
{"$rows_left_out":533}
{"sheet":"Results","index":5,"n_rows":91,"n_cols":17,"rows_kept":91,"cut":false,"hidden":false,"merged":[]}
[]
[]
[]
[null,null,null,null,null,null,null,null,null,null,null,null,null,null,null,null,"(hide)"]
["Prepared for:",null,{"$f":"Assumptions!B5","v":"{Client Name}"},null,null,null,{"$f":"NOW()","v":"2025-10-02T09:57:56.310"}]
["Prepared by:",null,{"$f":"Assumptions!B6","v":"{Adviser Name}"}]
{"$rows_left_out":86}
{"sheet":"Detailed Calcs","index":6,"n_rows":246,"n_cols":196,"rows_kept":246,"cut":false,"hidden":false,"merged":[]}
[null,null,null,null,null,null,null,null,null,null,null,null,null,null,null,null,null,null,null,null,null,null,null,null,null,null,null,null,null,null,null,null,null,null,null,null,null,null,null,null,null,null,null,null,null,null,null,null,null,null,null,null,null,null,null,null,null,null,null,null,null,null,null,null,null,null,null,null,null,null,null,null,null,null,null,null,null,null,null,null,null,null,null,null,null,null,null,null,null,null,null,null,null,null,null,null,null,null,null,null,null,null,null,null,null,null,null,null,null,null,null,null,null,null,null,null,null,null,null,null,null,null,null,null,null,null,null,null,null,null,null,null,null,null,null,null,null,null,null,null,null,null,null,null,null,null,null,null,null,null,null,null,null,null,null,null,null,null,null,null,null,null,null,null,null,null,null,null,null,null,null,null,null,null,null,{"$f":"IRR(FT6:FT246,-0.2)","v":-2.2204460492503131E-16},{"$f":"(1+FT1)^12-1","v":-2.6645352591003757E-15}]
[null,null,null,null,null,null,null,null,null,null,null,null,null,null,null,null,null,null,null,null,null,null,null,null,null,null,null,null,null,null,null,null,null,null,null,null,null,null,null,null,null,null,null,null,null,null,null,null,null,null,null,null,null,null,null,null,null,null,null,null,null,null,null,null,null,null,null,null,null,null,null,null,null,null,null,null,null,null,null,null,null,null,null,{"$f":"CE8+Loan_month*(1+annual_index)^($A8-1)","v":113000},null,null,null,null,null,null,null,null,null,null,null,null,null,null,null,null,null,null,null,null,null,null,null,null,null,null,null,null,null,null,null,null,null,null,null,null,null,null,null,null,null,null,null,null,null,null,null,null,null,null,null,null,null,null,null,null,null,null,null,null,null,null,null,null,null,null,null,null,null,null,null,null,null,null,null,null,null,null,null,null,null,null,null,null,null,null,null,null,null,"Internal rate of return cashflows and calculation:"]
[null,null,null,null,null,null,null,null,null,null,null,null,null,null,null,null,null,null,null,null,null,null,null,null,null,null,null,null,null,null,null,null,null,null,null,null,null,null,null,null,null,null,null,null,null,null,null,null,null,null,null,null,null,null,null,null,null,null,null,null,null,null,null,null,null,null,null,null,null,null,null,null,null,null,null,null,null,null,null,null,null,null,null,{"$f":"CE8+FV(annual_index,$A8-1,,-Loan_month)","v":113000},null,null,null,null,null,null,null,null,null,null,null,null,null,null,null,null,null,null,null,null,null,null,null,null,null,null,null,null,null,null,null,null,null,null,null,null,null,null,null,null,null,null,null,null,null,null,null,null,null,null,null,null,null,null,null,null,null,null,null,null,null,null,null,null,null,null,null,null,null,"End of year - income for year",null,null,null,null,null,null,null,null,null,null,null,null,null,null,null,null,null,null,null,"Geared IRR",null,{"$f":"(1+FT5)^12-1","v":-1.865174681370263E-14},null,"Ungeared IRR",null,{"$f":"(1+FX5)^12-1","v":-1.865174681370263E-14}]
[null,null,null,null,null,null,null,null,null,null,null,null,null,null,null,null,null,null,null,null,null,null,null,null,null,null,null,null,null,null,null,null,null,null,null,null,null,null,null,null,null,null,null,null,null,null,null,null,null,null,null,null,null,null,null,null,null,null,null,null,null,null,null,null,null,null,null,null,null,null,null,null,null,null,null,null,null,null,null,null,null,null,null,null,null,null,null,null,null,null,null,null,null,null,null,null,null,null,null,null,null,null,null,null,null,null,null,null,null,null,null,null,null,null,null,null,null,null,null,null,null,null,null,null,null,null,null,null,null,null,null,null,null,null,null,null,null,null,null,null,null,null,null,null,null,null,null,null,null,null,null,null,null,"End of year- tax benefit less R/I of income, if next year included in projection",null,null,null,null,null,null,null,null,null,null,null,null,null,null,null,null,null,null,null,null,null,"Cashflows",null,null,null,"Cashflows"]
["Geared",null,null,null,null,null,null,null,null,null,null,null,null,null,null,null,null,null,null,null,null,null,null,null,null,null,null,null,null,null,null,null,null,null,null,null,null,null,null,"Value","Cashflows invested during month (new loan + new capital amounts - exclude capitalised interest loan increase)",null,null,null,null,null,null,null,null,null,null,null,null,null,"Units purchased (start of month)",null,null,null,null,null,null,null,null,null,null,null,null,null,"Income received on investments made during year",null,null,null,null,null,null,null,null,null,null,null,null,null,null,2,3,4,5,6,7,8,9,10,11,12,null,"Capitalised interest - end of month",null,null,null,null,null,null,null,null,null,null,null,null,"Capital invested during month - start of month = end of preceding month",null,null,null,null,null,null,null,null,null,null,null,null,"Interest incurred by month",null,null,null,null,null,null,null,null,null,null,null,"Investment income by month",null,null,null,null,null,null,null,null,null,null,null,"Total",null,null,null,null,null,null,null,"End of term: Proceeds, loan repayment, CGT & income tax",null,null,null,null,null,null,"Cashflows for Internal rate of return calculation",null,null,null,null,null,null,null,null,null,null,null,null,null,null,{"$f":"IRR(FT6:FT246,0.00001)","v":-1.5543122344752192E-15},null,null,null,{"$f":"IRR(FX6:FX246,0.00001)","v":-1.5543122344752192E-15},null,null,"Example "]
["Year","Capital start of year","Loan at start of year","Interest payable","Reinvestment ","Total Investment Value Start of year","No. of units start of year","Loan to Investment Ratio","Entry fees","Income Received","Franking Credits","Unit Price start of year","Unit Price end of year","Units purchased over year","Own Equity contributed during year","Additional borrowings during year","Total Invested over year","Other Taxable Income","Total Assessable Income","MTR","Tax + Medicare Levy on total assessable income","Tax + Medicare Levy on Other Income","Tax + ML payable on investment, net of franking credits","Net cashflow from Investment","Funds available for Reinvestment","Capital at end of year","Loan at end of year","Sale of units","Capital Gain net of costs","Gain on units held for less than 12 months","Assessable Capital Gain","Total Taxable Income","Tax + ML","Tax + ML on investment","Profit from investment","Net realised portfolio value end of year after loan repaid",null,null,null,0,1,2,3,4,5,6,7,8,9,10,11,12,"Total Cash invested",null,1,2,3,4,5,6,7,8,9,10,11,12,"Total ","Check Average Price paid for units",1,2,3,4,5,6,7,8,9,10,11,12,"Total ","Check average yield","Loan at start of month 1","start 2","start 3","start 4","start 5","start 6","start 7","start 8","start 9","start 10","start 11","start 12","End of month 12",1,2,3,4,5,6,7,8,9,10,11,12,"Total for year",1,2,3,4,5,6,7,8,9,10,11,12,"Total",1,2,3,4,5,6,7,8,9,10,11,12,1,2,3,4,5,6,7,8,9,10,11,12,"Total",1,2,3,4,5,6,7,8,9,10,11,12,"Year included in projection",null,1,2,3,4,5,6,7,8,9,10,11,12,null,null,0,{"$f":"-Capital","v":-100000},null,null,0,{"$f":"-Capital","v":-100000},null,null,"Months in row years",null,null,null,null,null,null,null,null,null,null,null,null,"Months"]
{"$rows_left_out":241}
{"sheet":"Graphs","index":7,"n_rows":67,"n_cols":38,"rows_kept":67,"cut":false,"hidden":false,"merged":[]}
[null,null,null,null,null,null,null,null,null,null,null,null,null,null,null,null,null,null,null,null,null,null,null,null,null,null,null,null,null,null,"Values for graphing",null,null,"(difference)"]
[null,null,null,null,null,null,null,null,null,null,null,null,null,null,null,null,null,null,null,null,null,null,null,null,null,null,null,null,null,null,"Year","Geared investment","Ungeared investment","Geared Investment","Geared Portfolio","Ungeared Portfolio","Difference","Loan"]
[null,null,null,null,null,null,null,null,null,null,null,null,null,null,null,null,null,null,null,null,null,null,null,null,null,null,null,null,null,null,0,{"$f":"'Detailed Calcs'!B7","v":100000},{"$f":"'Detailed Calcs'!B31","v":100000},{"$f":"AF3-AG3","v":0},{"$f":"'Detailed Calcs'!F7","v":200000},{"$f":"'Detailed Calcs'!F31","v":100000},{"$f":"AI3-AJ3","v":100000},{"$f":"loan","v":100000}]
[null,null,null,null,null,null,null,null,null,null,null,null,null,null,null,null,null,null,null,null,null,null,null,null,null,null,null,null,null,null,1,{"$f":"'Detailed Calcs'!AJ7","v":111000},{"$f":"'Detailed Calcs'!AJ31","v":111000},{"$f":"AF4-AG4","v":0},{"$f":"IF(ISNUMBER(AE4),IF(AE4=time_horizon,'Detailed Calcs'!AB7,'Detailed Calcs'!F8),\"\")","v":222000},{"$f":"IF(ISNUMBER(AE4),IF(AE4=time_horizon,'Detailed Calcs'!AB31,'Detailed Calcs'!F32),\"\")","v":111000},{"$f":"AI4-AJ4","v":111000},{"$f":"'Detailed Calcs'!AA7","v":111000}]
[null,null,null,null,null,null,null,null,null,null,null,null,null,null,null,null,null,null,null,null,null,null,null,null,null,null,null,null,null,null,{"$f":"IF(ISNUMBER(AE4),IF(AE4+1>time_horizon,\"\",AE4+1),\"\")","v":2},{"$f":"'Detailed Calcs'!AJ8","v":123000},{"$f":"'Detailed Calcs'!AJ32","v":123000},{"$f":"AF5-AG5","v":0},{"$f":"IF(ISNUMBER(AE5),IF(AE5=time_horizon,'Detailed Calcs'!AB8,'Detailed Calcs'!F9),\"\")","v":246000},{"$f":"IF(ISNUMBER(AE5),IF(AE5=time_horizon,'Detailed Calcs'!AB32,'Detailed Calcs'!F33),\"\")","v":123000},{"$f":"AI5-AJ5","v":123000},{"$f":"'Detailed Calcs'!AA8","v":123000}]
[null,null,null,null,null,null,null,null,null,null,null,null,null,null,null,null,null,null,null,null,null,null,null,null,null,null,null,null,null,null,{"$f":"IF(ISNUMBER(AE5),IF(AE5+1>time_horizon,\"\",AE5+1),\"\")","v":3},{"$f":"'Detailed Calcs'!AJ9","v":135000},{"$f":"'Detailed Calcs'!AJ33","v":135000},{"$f":"IF(ISNUMBER(AF6-AG6),AF6-AG6,\"\")","v":0},{"$f":"IF(ISNUMBER(AE6),IF(AE6=time_horizon,'Detailed Calcs'!AB9,'Detailed Calcs'!F10),\"\")","v":270000},{"$f":"IF(ISNUMBER(AE6),IF(AE6=time_horizon,'Detailed Calcs'!AB33,'Detailed Calcs'!F34),\"\")","v":135000},{"$f":"IF(ISNUMBER(AI6-AJ6),AI6-AJ6,\"\")","v":135000},{"$f":"'Detailed Calcs'!AA9","v":135000}]
{"$rows_left_out":62}
{"sheet":"Goal seek","index":8,"n_rows":55,"n_cols":118,"rows_kept":55,"cut":false,"hidden":false,"merged":[]}
[]
[]
[]
[]
["Prepared for:",null,{"$f":"Assumptions!B5","v":"{Client Name}"},null,null,{"$f":"NOW()","v":"2025-10-02T09:57:56.310"},null,null,null,null,null,null,null,null,null,null,null,null,null,null,null,null,null,null,null,null,null,null,null,null,null,null,null,null,null,null,null,null,null,null,null,null,null,null,null,null,null,null,null,null,"Value","Cashflows invested during month (new loan + new capital amounts)",null,null,null,null,null,null,null,null,null,null,null,null,null,"Units purchased (start of month)",null,null,null,null,null,null,null,null,null,null,null,null,null,null,null,null,null,null,null,null,null,null,null,null,null,null,null,null,null,null,null,null,null,null,null,null,null,null,null,"Capital invested during month"]
["Prepared by:",null,{"$f":"Assumptions!B6","v":"{Adviser Name}"}]
{"$rows_left_out":49}